Home > Error Code > Installer Failed With Return Code -1073741819

Installer Failed With Return Code -1073741819

Contents

The installation of one or more products has failed. If the service is installed, to know the status of the service exection, you could also goto services.msc in the command prompt, check the status of the Windows Installer Service. "Stopping and ERROR_PATCH_PACKAGE_REJECTED1643The patch package is not permitted by system policy. One can find that the biggest hurdle to debugging a failed setup is often zeroing in on which part of the setup is actually failing, and this trick of searching for his comment is here

Note: In the log file 'Sophos Endpoint Bootstrap_[TimeStamp].txt', you will also see and error such as: ERROR,There was an unexpected problem with the installation of Sophos Endpoint Security and Control. For example, the log file: 'Sophos MCS Install Log.txt' under %temp% or 'C:\windows\temp\' Tip: Searching the MSI log file for the text: Return value 3 should help you identify a custom Note the values listed for TEMP and TMP, and delete all files in those locations. Downloads and tools Windows 10 dev tools Visual Studio Windows SDK Windows Store badges Essentials API reference (Windows apps) API reference (desktop apps) Code samples How-to guides (Windows apps) Learning resources

Msi Error Codes

Upcoming Events Webinar - XVUE Remote Control Integrated with Ghost Solution Suite (GSS) 29 Nov, 2016 - 11:00 EST Sacramento EPM User Group Meeting - December 9, 2016 09 Dec, 2016 MSI (c) (D8:44) [20:23:46:318]: Destroying RemoteAPI object. Print and File sharing is not installed or enabled when installing MSDE 2000.

ERROR_INSTALL_PLATFORM_UNSUPPORTED1633This installation package is not supported on this platform. Privacy statement  © 2016 Microsoft. ERROR_PATCH_MANAGED_ADVERTISED_PRODUCT 1651Administrative user failed to apply patch for a per-user managed or a per-machine application that is in advertise state. Exit Code 1603 Sccm Close all running applications and utilities, and launch the installation again.

Contact your support personnel to verify that the Windows Installer service is properly registered. Msi Error Code 1603 After which the the 'MCSClient.log' file should be analysed to find the exact cause for the failure. new ova comes with VMXNET3 where older OVAs (like for 8.6) used flexible type. The GUID '{A1DC5EF8-DD20-45E8-ABBD-F529A24D477B}'in the above case is for the product 'Sophos Management Communications System' (MCS).

It really depends on what you find in it though.Jason | http://blog.configmgrftw.com Marked as answer by Phil Balderos Thursday, September 19, 2013 11:27 AM Tuesday, September 17, 2013 8:54 PM Reply Mainenginethread Is Returning 1603 May be this will help some others, too. This error occurs when I tried to install the extension pack: The installer failed with exit code 1: VBoxExtPackHelperApp.exe: error: Failed to rename the extension pack directory: VERR_ACCESS_DENIED rcExit=1. But I am not able to get Error 1603 handled.

Msi Error Code 1603

This install is crappy. ERROR_INSTALL_TRANSFORM_REJECTED1644One or more customizations are not permitted by system policy. Msi Error Codes I installed VirtualBox 4.0.0 onto Windows 7 Professional and attempted to install the extension pack: Oracle_VM_VirtualBox_Extension_Pack-4.0.0-69151.vbox-extpack The attempt failed with: The installer failed with exit code 1: VBoxExtPackHelperApp.exe: error: Failed to Psexec Error Code 1619 This message is indicative of a success.

ERROR_INVALID_HANDLE_STATE1609The handle is in an invalid state. this content What happens if you manually run the setup? Tested so far: safe mode, disabling antivirus, deliberately disabling UAC, cleaning up extpacks and installing through elevated CMD... Vbox 5.0.0-r101573 Failed to install the Extension Pack C:/Temp/Oracle_VM_VirtualBox_Extension_Pack-5.0.0-101573.vbox-extpack. Windows Installer Error Codes

The old utility can be downloaded here: http://www.softpedia.com/progDownload/Windows-Inst... 0 Login to vote ActionsLogin or register to post comments desinet3 Understanding Error 1603: Fatal Error During Installation - Comment:09 Aug 2012 : Error Message: The installer failed with exit code 1: VBoxExtPackHelperApp.exe: error: Failed to rename the temporary directory to the final one: VERR_ACCESS_DENIED ('C:\PROGRA~1\ Oracle\VIRTUA~1\ExtensionPacks\Oracle_VM_VirtualBox_Extension_Pack-_-inst-5752' ->'C:\PROGRA~1\Oracle\VIRTUA~1\ExtensionPacks\Oracle_VM_VirtualBox_Extension_Pack') Result Code: E_FAIL (0x80004005) Component: ExtPackManager If it doesn't fall in this last, it could be any other error which occurred during the installation, do update in the comments..lets fix that..! http://offsethq.com/error-code/installation-failed-with-error-code-0x800c0005.html Print and File sharing is not installed if your application needs it.

Verify that the package exists and that you can access it, or contact the application vendor to verify that this is a valid Windows Installer package." This indicates that the exe Msi Error 1619 Windows 7 If you choose to participate, the online survey will be presented to you when you leave the Technet Web site.Would you like to participate? https://service.mcafee.com/FAQDocument.aspx?id=TS101331 0 Login to vote ActionsLogin or register to post comments SymNewComer Understanding Error 1603: Fatal Error During Installation - Comment:14 Oct 2014 : Link Hi All, I got the 1603

I suffered this nasty bug lots of times, long time ago, but it always could be solved going into safe mode.

MSI (c) (D8:F8) [20:23:41:685]: Cloaking enabled. Can you guys iron this out? (You'll see how VirtualBox extensions is one of the only activities that runs into this sort of problem.) Thank you. Thank you Regards!! Psexec Error Code 1603 E.g: http://dci.sophosupd.com/ https://mcs-amzn-eu-west-1-9af7.upe.p.hmr.sophos.com/sophos/management/ep Note:if SophosInstall.exe is run as SYSTEM, in the case of GPO start-up script then ensure that the SYSTEM user has access to the Internet and any proxy information

ERROR_BAD_CONFIGURATION1610The configuration data for this product is corrupt. In addition to that the MCS server being accessed will also be listed, e.g.:'https://mcs-amzn-eu-west-1-9af7.upe.p.hmr.sophos.com/sophos/management/ep', for the above example, can the Sophos certificate be obtained from this URL. ERROR_INVALID_DATA13The data is invalid. http://offsethq.com/error-code/installation-failed-error-code-1601.html Here it is: After 2 days, I finally made Skype and Facebook VideoCall both work on my Windows8 Dell computer.

Make sure no other applications, including utilities such as virus scanners, are running in the background. The install process for ext packs really needs to be tightened-up to handle standard anti-v scanning programs OR a manifest note / install pop-up recommending temporary disable of anti-v processes. I tried to install SVS on a Vista Home Premium machine. Tip: Searching the log file for the text: ERROR should help you identify the failure be this an error message or HTTP response code.

If successful, you can then attempt to run the Sophos Central installer again. 124 Cause The Sophos Central installer has failed to install for an unknown reason. See More 1 2 3 4 5 Overall Rating: 0 (0 ratings) Log in or register to post comments ActionsThis Discussion 1 Votes Follow Shortcut Abuse PDF Related Content Show - The return code for an installation can be found at the end of the 'Sophos Endpoint Bootstrap_[Timestamp].txt' log, typically in the user's temp location, i.e. %temp%. A way to think about it is the first pass "conditionally installs the change" to the machine while checking the syntax of the command and the second pass "commits the change

What To Do The MSI installation logs of the MCS package should be checked to identify an issue with the installation. However, I did find a solution. ERROR_FUNCTION_NOT_CALLED1626The function could not be executed. A Windows Installer package, patch, or transform that has not been signed by Microsoft cannot be installed on an ARM computer.

ERROR_PRODUCT_VERSION1638Another version of this product is already installed. ERROR_INSTALL_REJECTED1654The app that you are trying to run is not supported on this version of Windows. To ensure that the Windows Installer Service is properly installed and configured, it is recommended that users install the file InstmsiA.exe on Windows 95/98/Me or InstmsiW.exe on Win NT systems. I had previously rejected UAC (user account control) as the cause because I found another user with the same symptoms running on a WIndows XP host.

To ensure that the Windows Installer Service is properly installed and configured, it is recommended that users install the file InstmsiA.exe on Windows 95/98/Me or InstmsiW.exe on Win NT systems. I built it, so I know best how to fix it. 3. See More 1 2 3 4 5 Overall Rating: 4.5 (2 ratings) Log in or register to post comments Robert Bustamante Thu, 10/09/2014 - 10:40 This worked for me, Thanks Manuel. What To Do See article119619 for guidance. 120 Cause The Sophos Central installer has failed to install Sophos AutoUpdate.