Home > Windows Installer > Installation Failed With Windows Installer Error 1624

Installation Failed With Windows Installer Error 1624


Note  If you are a user experiencing difficulty with your computer either during or after installing or uninstalling an application, you should contact customer support for the software you are trying to For more information, see _MSIExecute Mutex. 1501 Error accessing secured data. GenerateTransform/Merge: Column name in base table doe... 2271: SummaryInformation write for transform failed. 2272: Database: [2]. Insufficient values in INSERT SQL statement.   2240 Database: [2]. weblink

If you choose to continue, a reboot will be required to complete the setup. Wrong state to CreateOutputDatabase [3].   2218 Database: [2]. Verify that the package exists and that you can access it, or contact the application vendor to verify that this is a valid Windows Installer package. See Securing Resources for information on using MsiLockPermissionsEx table.

Windows Installer Error Codes

ERROR_PATCH_PACKAGE_OPEN_FAILED 1636 This patch package could not be opened. In the Control Panel, select Programs. Transaction not started. 2763: Cannot run script.

No path exists for entry [2] in Directory table.   2708 No entries found in the file table.   2709 The specified Component name ('[2]') not found in Component table.   Available with Windows Installer version 4.0. 2701 The depth of a feature exceeds the acceptable tree depth of [2] levels. Verify that you have sufficient permis... 1909: Could not create shortcut [2]. Windows Installer Error 1619 Contact your supp... 1611: The component qualifier not present. 1612: The installation source for this product is not available.

Yes No Additional feedback? 1500 characters remaining Submit Skip this Thank you! Msi Error Code 1603 Contact your support personnel.   1917 Error removing ODBC driver: [4], ODBC error [2]: [3]. Try the installation again using a valid copy of the installation package '[3]'. ERROR_UNKNOWN_COMPONENT 1608 Unknown property.

When trouble-shooting the DLL you may need to use one or more of the tools described in KB198038. 2738 Could not access VBScript run time for custom action [2]. Windows Installer Returned 1613 Vmware Is there a way to prevent this (via some command line switch, perhaps), other than by removing this machine from the group policy in quesiton? GetLastError: [2]. 2304: Error getting disk free space. System error [3].   1405 Could not read value [2] from key [3].

  • GetLastError() returned: [3]. 2901: Invalid parameter to operation [2]: Parameter [3]. 2902: Operation ?
  • This error could indicate a network error, an error reading from the CD-ROM, or a problem with this package.
  • This error code is returned if the user chooses not to try the installation.
  • Uninstall and reinstall the program. 1335 The cabinet file '[filename]' required for this installation is corrupt and cannot be used.

Msi Error Code 1603

Expected language [4], found language [5]. This is a problem with the package. Windows Installer Error Codes ERROR_INSTALL_LOG_FAILURE 1623 This language of this installation package is not supported by your system. Msiexec Error Codes System error [4].   1407 Could not get value names for key [2].

Solution: Make sure you have the permissions to write to the log file. http://offsethq.com/windows-installer/installation-error-windows-xp.html Cannot open database file. More info here. 1620 ERROR_INSTALL_PACKAGE_INVALID This installation package could not be opened. Column '[3]' not present or ambiguous in SQL query: [4... 2236: Database: [2]. Msi Motherboard Error Codes

Invalid identifier '[3]' in SQL query: [4].   2228 Database: [2]. ERROR_APPHELP_BLOCK1259If Windows Installer determines a product may be incompatible with the current operating system, it displays a dialog box informing the user and asking whether to try to install anyway. Do you want to undo those changes?   1706 No valid source could be found for product [2].   1707 Installation operation completed successfully.   1708 Installation operation failed.   1709 check over here The user has cancelled the installation.

Column '[3]' repeated.   2243 Database: [2]. There Was An Error Applying Transforms. Verify That The Specified Transform Paths Are Valid. For Windows Me, see the InstallSFPCatalogFile action, the FileSFPCatalog table, and the SFPCatalog table. 2940 Directory Manager not supplied for source resolution.   2941 Unable to compute the CRC for file [2]. A system restart may be required because the file being updated is also currently in use.

ERROR_INSTALL_UI_FAILURE1621There was an error starting the Windows Installer service user interface.

Transform failed. 2227: Database: [2]. Configuring services is supported only on Windows Vista/Server 2008 and above. Type mismatch in parameter: [3].   2259 Database: [2] Table(s) Update failed Queries must adhere to the restricted Windows Installer SQL syntax. 2260 Storage CopyTo failed. Windows Installer Returned 1639 Verify that the patch package... 1636: This patch package could not be opened.

Alternative solution: This error sometimes appears when a drive is mapped for the user and the installer is running in a system context. If you're trying to repair a broken installation, you can use Add or Remove Programs (Programs and Features) in Control Panel or redeploy the package through GPO. GetLastError: [2].   2304 Error getting disk free space. this content Cannot open database file.

What do the various Windows Installer (MSI) error codes mean? Go to the Adobe Reader Downloads page and click Download Now. Import file format error: [3], Line [4].   2217 Database: [2]. You must install a Windows service pack that contains a newer version of the Windows Installer service.

May occur if the first 40 characters of two or more component names are identical. GetLastError() returned: [2]. 2896: Executing action [2] failed. 2897: Failed to create any [2] font on this system. 2898: For [2] textstyle, the system created a '[3]' font, in [4] character Solution: Check the location and make sure no process holds it locked. Open new Case Open a new case Continue Searching Click here to go to our Support page.

Join a real-time chat and ask the experts. Verify that you have sufficient privileges to modify the security permissions for this file.   1927 The installation requires COM+ Services to be installed.   1928 The installation failed to install Type mismatch in parameter: [3]. 2259: Database: [2] Table(s) Update failed 2260: Storage CopyTo failed. ERROR_INSTALL_PACKAGE_REJECTED 1626 Function could not be executed.

Contact your application vendor. 1634 ERROR_INSTALL_NOTUSED Component not used on this computer. 1635 ERROR_PATCH_PACKAGE_OPEN_FAILED This patch package could not be opened. Windows 8:Go to the upper- or lower-right corner of the desktop and activate the Charm bar. ERROR_UNKNOWN_FEATURE1606The feature identifier is not registered. Multiple-Package Installations cannot run if rollback is disabled.

Verify that you have sufficient permissi... 1908: Could not unregister font [2]. Verify that the packag... 1620: This installation package could not be opened. GetLastError: [2]. 2331: Error loading library [2] or finding entry point [3]. 2332: Error getting file attributes. ERROR_INSTALL_REMOTE_PROHIBITED1645Windows Installer does not permit installation from a Remote Desktop Connection.